]> granicus.if.org Git - vim/shortlog
vim
2022-03-24 Bram Moolenaarpatch 8.2.4618: cmdline completion does not recognize... v8.2.4618
2022-03-24 Yegappan Lakshmananpatch 8.2.4617: no completion for :scriptnames v8.2.4617
2022-03-23 Bram Moolenaarpatch 8.2.4616: Vim9: Declarations in a {} block of... v8.2.4616
2022-03-23 Bram Moolenaarpatch 8.2.4615: mapping with escaped bar does not work... v8.2.4615
2022-03-23 zeertzjqpatch 8.2.4614: redrawing too much when 'cursorline... v8.2.4614
2022-03-23 zeertzjqpatch 8.2.4613: return type of swapfile_unchanged(... v8.2.4613
2022-03-23 Bram Moolenaarpatch 8.2.4612: Vim9: cannot use a recursive call in... v8.2.4612
2022-03-22 Dominique Pellepatch 8.2.4611: typos in tests; one lua line not covere... v8.2.4611
2022-03-22 Bram Moolenaarpatch 8.2.4610: some conditions are always true v8.2.4610
2022-03-22 Bram Moolenaarpatch 8.2.4609: :unhide does not check for failing... v8.2.4609
2022-03-22 Yegappan Lakshmananpatch 8.2.4608: getcompletion() does not work when... v8.2.4608
2022-03-22 Yegappan Lakshmananpatch 8.2.4607: sourcing buffer lines may lead to error... v8.2.4607
2022-03-21 Bram Moolenaarpatch 8.2.4606: test fails because of changed error... v8.2.4606
2022-03-21 Bram Moolenaarpatch 8.2.4604: error for redefining a script item... v8.2.4604
2022-03-21 Yegappan Lakshmananpatch 8.2.4603: sourcing buffer lines is too complicated v8.2.4603
2022-03-20 Bram Moolenaarpatch 8.2.4602: Vim9: not enough test coverage for... v8.2.4602
2022-03-20 Bram Moolenaarpatch 8.2.4601: Vim9: not enough test coverage for... v8.2.4601
2022-03-20 Bram Moolenaarpatch 8.2.4600: Vim9: not enough test coverage for... v8.2.4600
2022-03-20 Bram Moolenaarpatch 8.2.4599: GTK: get assertion errors when scrollin... v8.2.4599
2022-03-20 Bram Moolenaarpatch 8.2.4598: profile completion test sometimes fails v8.2.4598
2022-03-20 Dominique Pellepatch 8.2.4597: LuaV_debug() not covered by tests v8.2.4597
2022-03-20 Sergei Trofimovichpatch 8.2.4596: installing tutor binary may fail v8.2.4596
2022-03-20 jsecchieropatch 8.2.4595: X11: using --remote-wait may keep the... v8.2.4595
2022-03-19 Bram MoolenaarUpdate runtime files
2022-03-19 Yegappan Lakshmananpatch 8.2.4594: need to write script to a file to be... v8.2.4594
2022-03-19 zeertzjqpatch 8.2.4593: unnecessary call to redraw_later() v8.2.4593
2022-03-19 Bram Moolenaarpatch 8.2.4592: search continues after giving E1204 v8.2.4592
2022-03-19 Bram Moolenaarpatch 8.2.4591: cursor line not updated when a callback... v8.2.4591
2022-03-18 Bram Moolenaarpatch 8.2.4590: Vim9: range type check has wrong offset v8.2.4590
2022-03-18 Bram Moolenaarpatch 8.2.4589: cannot index the g: dictionary v8.2.4589
2022-03-18 Bram Moolenaarpatch 8.2.4588: mapping with key after other matching... v8.2.4588
2022-03-18 Bram Moolenaarpatch 8.2.4587: Vim9: double free after unpacking a... v8.2.4587
2022-03-17 Bram Moolenaarpatch 8.2.4586: Vim9: no error for using lower case... v8.2.4586
2022-03-17 Yegappan Lakshmananpatch 8.2.4585: cannot use keypad page-up/down for... v8.2.4585
2022-03-17 Bram Moolenaarpatch 8.2.4584: error for using autoload function in... v8.2.4584
2022-03-16 Bram Moolenaarpatch 8.2.4583: screendump test fails v8.2.4583
2022-03-16 Bram Moolenaarpatch 8.2.4582: useless code handling a type declaration v8.2.4582
2022-03-16 Bram Moolenaarpatch 8.2.4581: null types not fully tested v8.2.4581
2022-03-16 Bram Moolenaarpatch 8.2.4580: Vim9: incorrect error for shadowing... v8.2.4580
2022-03-16 Yegappan Lakshmananpatch 8.2.4579: cannot use page-up and page-down in... v8.2.4579
2022-03-16 Bram Moolenaarpatch 8.2.4578: no warning when autoload script for... v8.2.4578
2022-03-16 Bram Moolenaarpatch 8.2.4577: message test is flaky v8.2.4577
2022-03-15 Bram Moolenaarpatch 8.2.4576: Vim9: error for comparing with null... v8.2.4576
2022-03-15 Bram Moolenaarpatch 8.2.4575: Vim9: test for profiling still fails v8.2.4575
2022-03-15 Bram Moolenaarpatch 8.2.4574: Vim9: test for profiling fails v8.2.4574
2022-03-15 Bram Moolenaarpatch 8.2.4573: a nested function is compiled for debug... v8.2.4573
2022-03-15 Bram Moolenaarpatch 8.2.4572: Vim9: return type "any" is changed... v8.2.4572
2022-03-15 Jade Lovelacepatch 8.2.4571: not all gdb files are recognized v8.2.4571
2022-03-15 Yegappan Lakshmananpatch 8.2.4570: no command line completion for :profile... v8.2.4570
2022-03-15 Bram Moolenaarpatch 8.2.4569: Coverity warning for not using a return... v8.2.4569
2022-03-15 Sean Dewarpatch 8.2.4568: getmousepos() does not compute the... v8.2.4568
2022-03-14 zeertzjqpatch 8.2.4567: bracketed paste doesn't work well in... v8.2.4567
2022-03-14 James Chertipatch 8.2.4566: check for existing buffer in session... v8.2.4566
2022-03-14 Bram Moolenaarpatch 8.2.4565: no command line completion for :breakad... v8.2.4565
2022-03-14 Bram Moolenaarpatch 8.2.4564: running test leaves file behind v8.2.4564
2022-03-13 Bram Moolenaarpatch 8.2.4563: "z=" in Visual mode may go beyond the... v8.2.4563
2022-03-13 Yegappan Lakshmananpatch 8.2.4562: linear tag search is not optimal v8.2.4562
2022-03-13 Bram Moolenaarpatch 8.2.4561: build failure with some combination... v8.2.4561
2022-03-13 ichizokpatch 8.2.4560: suspending with CTRL-Z does not work... v8.2.4560
2022-03-13 Bram Moolenaarpatch 8.2.4559: getmousepos() returns the screen column v8.2.4559
2022-03-13 Bram Moolenaarpatch 8.2.4558: Motif: using default colors does not... v8.2.4558
2022-03-13 zeertzjqpatch 8.2.4557: confusing comment about 'cursorlineopt' v8.2.4557
2022-03-13 Bram Moolenaarpatch 8.2.4556: test fails without the +job or +channel... v8.2.4556
2022-03-13 Bram Moolenaarpatch 8.2.4555: getmousepos() returns the wrong column v8.2.4555
2022-03-12 Bram Moolenaarpatch 8.2.4554: Vim9: using null values not sufficientl... v8.2.4554
2022-03-12 Yegappan Lakshmananpatch 8.2.4553: linear tag search is a bit slow v8.2.4553
2022-03-12 Bram Moolenaarpatch 8.2.4552: in a :def function "put = expr" does... v8.2.4552
2022-03-12 Bram Moolenaarpatch 8.2.4551: when mapping <Esc> terminal codes are... v8.2.4551
2022-03-12 Bram Moolenaarpatch 8.2.4550: Motif: cannot set the color of the... v8.2.4550
2022-03-12 Bram Moolenaarpatch 8.2.4549: cannot build with Motif and editres v8.2.4549
2022-03-11 Bram Moolenaarpatch 8.2.4548: script-local function is deleted when... v8.2.4548
2022-03-11 Bram Moolenaarpatch 8.2.4547: the neXTaw GUI is old and does not... v8.2.4547
2022-03-11 zeertzjqpatch 8.2.4546: duplicate #undef v8.2.4546
2022-03-11 Christian Brabandtpatch 8.2.4545: MS-Windows: the installed icon is low... v8.2.4545
2022-03-11 Bram Moolenaarpatch 8.2.4544: Coverity warnings for not using returne... v8.2.4544
2022-03-11 Yegappan Lakshmananpatch 8.2.4543: Coverity warning for refactored tag... v8.2.4543
2022-03-10 Bram Moolenaarpatch 8.2.4542: Vim9: "break" inside try/catch not... v8.2.4542
2022-03-10 Bram Moolenaarpatch 8.2.4541: Crash in debugger when a variable is... v8.2.4541
2022-03-10 Bram Moolenaarpatch 8.2.4540: line number for error is off by one v8.2.4540
2022-03-10 Bram Moolenaarpatch 8.2.4539: when comparing special v:none and v... v8.2.4539
2022-03-10 Yegappan Lakshmananpatch 8.2.4538: the find_tags_in_file() function is... v8.2.4538
2022-03-10 =?UTF-8?q?Dundar... patch 8.2.4537: output from linter and language server... v8.2.4537
2022-03-10 Bram Moolenaarpatch 8.2.4536: debugger test fails when breaking on... v8.2.4536
2022-03-10 Christian Brabandtpatch 8.2.4535: filename modifer ":8" removes the filename v8.2.4535
2022-03-10 Bram Moolenaarpatch 8.2.4534: Vim9: "is" operator with empty string... v8.2.4534
2022-03-09 Bram Moolenaarpatch 8.2.4533: Vim9: no test that after assigning... v8.2.4533
2022-03-09 Stuart Hendersonpatch 8.2.4532: suspending with CTRL-Z does not work... v8.2.4532
2022-03-09 =?UTF-8?q?Dundar... patch 8.2.4531: LGTM warnings for condition and buffer... v8.2.4531
2022-03-09 Bram Moolenaarpatch 8.2.4530: making comparison with null work change... v8.2.4530
2022-03-08 Bram MoolenaarUpdate runtime files
2022-03-08 Bram Moolenaarpatch 8.2.4529: Vim9: comparing partial with function... v8.2.4529
2022-03-08 Bram Moolenaarpatch 8.2.4528: crash when using null_function for... v8.2.4528
2022-03-08 Bram Moolenaarpatch 8.2.4527: the Athena GUI is old and does not... v8.2.4527
2022-03-08 Bram Moolenaarpatch 8.2.4526: Vim9: cannot set variables to a null... v8.2.4526
2022-03-07 Yegappan Lakshmananpatch 8.2.4525: some GUI tests don't work on Athena v8.2.4525
2022-03-07 K.Takatapatch 8.2.4524: MS-Windows: cannot build with some... v8.2.4524
2022-03-07 K.Takatapatch 8.2.4523: when gvim is started maximized the... v8.2.4523
2022-03-06 Bram Moolenaarpatch 8.2.4522: GUI test fails with Motif v8.2.4522
2022-03-06 Bram Moolenaarpatch 8.2.4521: build failure without the +diff feature v8.2.4521
2022-03-06 Bram Moolenaarpatch 8.2.4520: using wrong highlight for cursor line... v8.2.4520
next