]> granicus.if.org Git - vim/shortlog
vim
2020-04-26 Bram Moolenaarpatch 8.2.0644: insufficient testing for invalid functi... v8.2.0644
2020-04-26 Bram Moolenaarpatch 8.2.0643: terminal uses brown instead of dark... v8.2.0643
2020-04-26 Bram Moolenaarpatch 8.2.0642: Vim9: using invalid index v8.2.0642
2020-04-26 Bram Moolenaarpatch 8.2.0641: Vim9: not expanded in :hardcopy and... v8.2.0641
2020-04-25 Bram Moolenaarpatch 8.2.0640: Vim9: expanding does not work v8.2.0640
2020-04-25 Bram Moolenaarpatch 8.2.0639: MS-Windows: messages test still fails v8.2.0639
2020-04-25 Bram Moolenaarpatch 8.2.0638: MS-Windows: messages test fails v8.2.0638
2020-04-25 Bram Moolenaarpatch 8.2.0637: incsearch highlighting does not work... v8.2.0637
2020-04-25 Bram Moolenaarpatch 8.2.0636: :messages does not show the maintainer... v8.2.0636
2020-04-25 Bram Moolenaarpatch 8.2.0635: when using 256 colors DarkYellow does... v8.2.0635
2020-04-25 Bram Moolenaarpatch 8.2.0634: crash with null partial and blob v8.2.0634
2020-04-24 Bram Moolenaarpatch 8.2.0633: crash when using null partial in filter() v8.2.0633
2020-04-24 Bram Moolenaarpatch 8.2.0632: crash when using Haiku v8.2.0632
2020-04-24 Bram Moolenaarpatch 8.2.0631: Haiku file formatted with wrong tabstop v8.2.0631
2020-04-24 Bram Moolenaarpatch 8.2.0630: "make tags" does not cover Haiku GUI... v8.2.0630
2020-04-24 Bram Moolenaarpatch 8.2.0629: setting a boolean option to v:false... v8.2.0629
2020-04-23 Bram Moolenaarpatch 8.2.0628: error in menu translations v8.2.0628
2020-04-23 Bram Moolenaarpatch 8.2.0627: Vim9: error message does not work v8.2.0627
2020-04-23 Bram Moolenaarpatch 8.2.0626: Vim9: wrong syntax of function in Vim9... v8.2.0626
2020-04-23 Bram Moolenaarpatch 8.2.0625: Vim9: confusing error when calling... v8.2.0625
2020-04-23 Bram Moolenaarpatch 8.2.0624: Vim9: no check for space before #comment v8.2.0624
2020-04-23 Bram Moolenaarpatch 8.2.0623: typo in test comment v8.2.0623
2020-04-23 Bram Moolenaarpatch 8.2.0622: Haiku: GUI does not compile v8.2.0622
2020-04-23 Bram Moolenaarpatch 8.2.0621: after running tests asan files may... v8.2.0621
2020-04-23 Bram Moolenaarpatch 8.2.0620: error in menu translations v8.2.0620
2020-04-23 Bram Moolenaarpatch 8.2.0619: null dict is not handled like an empty... v8.2.0619
2020-04-22 Bram Moolenaarpatch 8.2.0618: echoing a null list results in no output v8.2.0618
2020-04-22 Bram Moolenaarpatch 8.2.0617: new error check triggers in Swedish... v8.2.0617
2020-04-21 Bram Moolenaarpatch 8.2.0616: build error when disabling the diff... v8.2.0616
2020-04-21 Bram Moolenaarpatch 8.2.0615: regexp benchmark stest is old style v8.2.0615
2020-04-21 Bram Moolenaarpatch 8.2.0614: get ml_get error when deleting a line... v8.2.0614
2020-04-20 Bram Moolenaarpatch 8.2.0613: Vim9: no check for space before #comment v8.2.0613
2020-04-20 Bram MoolenaarUpdate runtime files
2020-04-20 Bram Moolenaarpatch 8.2.0612: Vim9: no check for space before #comment v8.2.0612
2020-04-20 Bram Moolenaarpatch 8.2.0611: Vim9: no check for space before #comment v8.2.0611
2020-04-20 Bram Moolenaarpatch 8.2.0610: some tests are still old style v8.2.0610
2020-04-20 Bram Moolenaarpatch 8.2.0609: configure does not detect moonjit correctly v8.2.0609
2020-04-20 Bram Moolenaarpatch 8.2.0608: warning from clang when building messag... v8.2.0608
2020-04-19 Bram Moolenaarpatch 8.2.0607: gcc warns for using uninitialized variable v8.2.0607
2020-04-19 Bram Moolenaarpatch 8.2.0606: several syntax HL errors not checked v8.2.0606
2020-04-19 Bram Moolenaarpatch 8.2.0605: Vim9: cannot unlet an environment variable v8.2.0605
2020-04-19 Bram Moolenaarpatch 8.2.0604: :startinsert in a terminal window used... v8.2.0604
2020-04-19 Bram Moolenaarpatch 8.2.0603: configure does not detect moonjit v8.2.0603
2020-04-19 Bram Moolenaarpatch 8.2.0602: :unlet $VAR does not work properly v8.2.0602
2020-04-19 Bram Moolenaarpatch 8.2.0601: Vim9: :unlet is not compiled v8.2.0601
2020-04-19 Bram Moolenaarpatch 8.2.0600: Vim9: cannot read or write w:, t: and... v8.2.0600
2020-04-19 Bram Moolenaarpatch 8.2.0599: Netbeans interface insufficiently tested v8.2.0599
2020-04-18 Bram Moolenaarpatch 8.2.0598: test_eval_stuff fails in normal terminal v8.2.0598
2020-04-18 Bram Moolenaarpatch 8.2.0597: test_eval is old style v8.2.0597
2020-04-18 Bram Moolenaarpatch 8.2.0596: crash in test49 v8.2.0596
2020-04-18 Bram Moolenaarpatch 8.2.0595: Vim9: not all commands using ends_excmd... v8.2.0595
2020-04-18 Bram Moolenaarpatch 8.2.0594: MS-Windows: cannot build with WINVER... v8.2.0594
2020-04-18 Bram Moolenaarpatch 8.2.0593: finding a user command is not optimal v8.2.0593
2020-04-17 Bram Moolenaarpatch 8.2.0592: MS-Windows with VTP: cursor is not... v8.2.0592
2020-04-17 Bram Moolenaarpatch 8.2.0591: MS-Windows: should always support IPv6 v8.2.0591
2020-04-17 Bram Moolenaarpatch 8.2.0590: no 'backspace' value allows ignoring... v8.2.0590
2020-04-17 Bram Moolenaarpatch 8.2.0589: .bsd file type not recognized v8.2.0589
2020-04-17 Bram Moolenaarpatch 8.2.0588: Putty does not use "sgr" 'ttymouse... v8.2.0588
2020-04-16 Bram Moolenaarpatch 8.2.0587: compiler warning for unused variable v8.2.0587
2020-04-16 Bram Moolenaarpatch 8.2.0586: Vim9: # comment not sufficiently tested v8.2.0586
2020-04-16 Bram Moolenaarpatch 8.2.0585: Vim9: # comment not recognized after... v8.2.0585
2020-04-16 Bram Moolenaarpatch 8.2.0584: viminfo file uses obsolete function... v8.2.0584
2020-04-16 Bram Moolenaarpatch 8.2.0583: Vim9: # comment not recognized in ... v8.2.0583
2020-04-15 Bram Moolenaarpatch 8.2.0582: color ramp test does not show text... v8.2.0582
2020-04-15 Bram Moolenaarpatch 8.2.0581: Win32 console: the cursor position... v8.2.0581
2020-04-15 Bram Moolenaarpatch 8.2.0580: window size wrong if 'ea' is off and... v8.2.0580
2020-04-14 Bram Moolenaarpatch 8.2.0579: Coverity warns for unused value v8.2.0579
2020-04-14 Bram Moolenaarpatch 8.2.0578: heredoc for interfaces does not support... v8.2.0578
2020-04-13 Bram Moolenaarpatch 8.2.0577: not all modifiers supported for :options v8.2.0577
2020-04-13 Bram Moolenaarpatch 8.2.0576: some errors are not covered by tests v8.2.0576
2020-04-13 Bram Moolenaarpatch 8.2.0575: :digraph! not tested v8.2.0575
2020-04-13 Bram Moolenaarpatch 8.2.0574: ipv6 feature not shown in :version... v8.2.0574
2020-04-13 Bram Moolenaarpatch 8.2.0573: using :version twice leaks memory v8.2.0573
2020-04-13 Bram Moolenaarpatch 8.2.0572: using two lines for free and reset v8.2.0572
2020-04-13 Bram Moolenaarpatch 8.2.0571: double free when passing invalid argume... v8.2.0571
2020-04-13 Bram Moolenaarpatch 8.2.0570: Vim9: no error when omitting type from... v8.2.0570
2020-04-13 Bram Moolenaarpatch 8.2.0569: build failure with tiny version v8.2.0569
2020-04-13 Bram Moolenaarpatch 8.2.0568: the man filetype plugin overwrites... v8.2.0568
2020-04-13 Bram Moolenaarpatch 8.2.0567: Vim9: cannot put comments halfway expre... v8.2.0567
2020-04-12 Bram Moolenaarpatch 8.2.0566: Vim9: variable can be used uninitialized v8.2.0566
2020-04-12 Bram Moolenaarpatch 8.2.0565: Vim9: tests contain superfluous line... v8.2.0565
2020-04-12 Bram Moolenaarpatch 8.2.0564: Vim9: calling a def function from non... v8.2.0564
2020-04-12 Bram Moolenaarpatch 8.2.0563: Vim9: cannot split a function line v8.2.0563
2020-04-12 Bram Moolenaarpatch 8.2.0562: Vim9: cannot split an expression into... v8.2.0562
2020-04-12 Bram Moolenaarpatch 8.2.0561: Vim9: cannot split function call in... v8.2.0561
2020-04-12 Bram Moolenaarpatch 8.2.0560: compiler warning in tiny build v8.2.0560
2020-04-12 Bram Moolenaarpatch 8.2.0559: clearing a struct is verbose v8.2.0559
2020-04-12 Bram Moolenaarpatch 8.2.0558: Vim9: dict code not covered by tests v8.2.0558
2020-04-12 Bram Moolenaarpatch 8.2.0557: no IPv6 support for channels v8.2.0557
2020-04-12 Bram Moolenaarpatch 8.2.0556: Vim9: memory leak when finding common... v8.2.0556
2020-04-12 Bram Moolenaarpatch 8.2.0555: Vim9: line continuation is not always... v8.2.0555
2020-04-12 Bram Moolenaarpatch 8.2.0554: the GUI doesn't set t_Co v8.2.0554
2020-04-12 Bram Moolenaarpatch 8.2.0553: error for unused argument v8.2.0553
2020-04-12 Bram Moolenaarpatch 8.2.0552: Vim9: some errors not covered by tests v8.2.0552
2020-04-12 Bram Moolenaarpatch 8.2.0551: not all code for options is tested v8.2.0551
2020-04-12 Bram Moolenaarpatch 8.2.0550: some changes in the libvterm upstream... v8.2.0550
2020-04-12 Bram Moolenaarpatch 8.2.0549: user systemd files not recognized v8.2.0549
2020-04-11 Bram Moolenaarpatch 8.2.0548: Vim9: not all possible func type errors... v8.2.0548
2020-04-11 Bram Moolenaarpatch 8.2.0547: Win32: restoring screen not always... v8.2.0547
2020-04-11 Bram Moolenaarpatch 8.2.0546: Vim9: varargs implementation is inefficient v8.2.0546
next