]> granicus.if.org Git - vim/shortlog
vim
2020-05-03 Bram Moolenaarpatch 8.2.0692: startup test fails on MS-Windows v8.2.0692
2020-05-03 Bram Moolenaarpatch 8.2.0691: startup test fails v8.2.0691
2020-05-03 Bram Moolenaarpatch 8.2.0690: line number of option set by modeline... v8.2.0690
2020-05-03 Bram Moolenaarpatch 8.2.0689: when using getaddrinfo() the error... v8.2.0689
2020-05-03 Bram Moolenaarpatch 8.2.0688: output clobbered if setting 'verbose... v8.2.0688
2020-05-03 Bram Moolenaarpatch 8.2.0687: some tests do not work on FreeBSD v8.2.0687
2020-05-03 Bram Moolenaarpatch 8.2.0686: formatoptions not sufficiently tested v8.2.0686
2020-05-03 Bram Moolenaarpatch 8.2.0685: Build failure v8.2.0685
2020-05-03 Bram Moolenaarpatch 8.2.0684: Vim9: memory leak when using lambda v8.2.0684
2020-05-02 Bram Moolenaarpatch 8.2.0683: Vim9: parsing type does not always... v8.2.0683
2020-05-02 Bram Moolenaarpatch 8.2.0682: Vim9: parsing function argument type... v8.2.0682
2020-05-02 Bram Moolenaarpatch 8.2.0681: pattern for 'hlsearch' highlighting... v8.2.0681
2020-05-02 Bram Moolenaarpatch 8.2.0680: PTYGROUP and PTYMODE are unused v8.2.0680
2020-05-02 Bram Moolenaarpatch 8.2.0679: Vim9: incomplete support for closures v8.2.0679
2020-05-02 Bram Moolenaarpatch 8.2.0678: rare crash for popup menu v8.2.0678
2020-05-01 Bram Moolenaarpatch 8.2.0677: Vim9: no support for closures v8.2.0677
2020-05-01 Bram Moolenaarpatch 8.2.0676: pattern in list of distributed files... v8.2.0676
2020-05-01 Bram MoolenaarUpdate runtime files
2020-05-01 Bram Moolenaarpatch 8.2.0675: Vim9: no support for closures v8.2.0675
2020-05-01 Bram Moolenaarpatch 8.2.0674: some source files are too big v8.2.0674
2020-05-01 Bram Moolenaarpatch 8.2.0673: cannot build Haiku in shadow directory v8.2.0673
2020-05-01 Bram Moolenaarpatch 8.2.0672: heredoc in scripts does not accept... v8.2.0672
2020-04-30 Bram Moolenaarpatch 8.2.0671: Haiku: compiler warnings v8.2.0671
2020-04-30 Bram Moolenaarpatch 8.2.0670: cannot change window when evaluating... v8.2.0670
2020-04-30 Bram Moolenaarpatch 8.2.0669: MS-Windows: display in VTP is a bit... v8.2.0669
2020-04-30 Bram Moolenaarpatch 8.2.0668: compiler warning for int/size_t usage v8.2.0668
2020-04-30 Bram Moolenaarpatch 8.2.0667: cannot install Haiku version from source v8.2.0667
2020-04-30 Bram Moolenaarpatch 8.2.0666: Ruby test fails on MS-Windows v8.2.0666
2020-04-30 Bram Moolenaarpatch 8.2.0665: wrongly assuming Python executable... v8.2.0665
2020-04-29 Bram Moolenaarpatch 8.2.0664: included undesired changes in Makefile v8.2.0664
2020-04-29 Bram Moolenaarpatch 8.2.0663: not all systemd temp files are recognized v8.2.0663
2020-04-29 Bram Moolenaarpatch 8.2.0662: cannot use input() in a channel callback v8.2.0662
2020-04-29 Bram Moolenaarpatch 8.2.0661: eval test is still old style v8.2.0661
2020-04-29 Bram Moolenaarpatch 8.2.0660: the search.c file is a bit big v8.2.0660
2020-04-28 Bram Moolenaarpatch 8.2.0659: Vim9: no test for equal func type v8.2.0659
2020-04-28 Bram Moolenaarpatch 8.2.0658: HP-UX build fails when setenv() is... v8.2.0658
2020-04-28 Bram Moolenaarpatch 8.2.0657: Vim9: no check if called variable is... v8.2.0657
2020-04-28 Bram Moolenaarpatch 8.2.0656: MS-Windows: redrawing right screen... v8.2.0656
2020-04-28 Bram Moolenaarpatch 8.2.0655: search code not sufficiently tested v8.2.0655
2020-04-27 Bram Moolenaarpatch 8.2.0654: building with Python fails v8.2.0654
2020-04-27 Bram Moolenaarpatch 8.2.0653: using uninitialized pointer v8.2.0653
2020-04-27 Bram Moolenaarpatch 8.2.0652: compiler warning for char conversion v8.2.0652
2020-04-27 Bram Moolenaarpatch 8.2.0651: old style benchmark test still in list... v8.2.0651
2020-04-27 Bram Moolenaarpatch 8.2.0650: Vim9: script function can be deleted v8.2.0650
2020-04-27 Bram Moolenaarpatch 8.2.0649: undo problem whn an InsertLeave autocom... v8.2.0649
2020-04-27 Bram Moolenaarpatch 8.2.0648: semicolon search does not work in first... v8.2.0648
2020-04-26 Bram Moolenaarpatch 8.2.0647: MS-Windows: repeat count for events... v8.2.0647
2020-04-26 Bram Moolenaarpatch 8.2.0646: t_Co uses the value of $COLORS in the GUI v8.2.0646
2020-04-26 Bram Moolenaarpatch 8.2.0645: MS-Windows terminal: CTRL-C does not... v8.2.0645
2020-04-26 Bram Moolenaarpatch 8.2.0644: insufficient testing for invalid functi... v8.2.0644
2020-04-26 Bram Moolenaarpatch 8.2.0643: terminal uses brown instead of dark... v8.2.0643
2020-04-26 Bram Moolenaarpatch 8.2.0642: Vim9: using invalid index v8.2.0642
2020-04-26 Bram Moolenaarpatch 8.2.0641: Vim9: not expanded in :hardcopy and... v8.2.0641
2020-04-25 Bram Moolenaarpatch 8.2.0640: Vim9: expanding does not work v8.2.0640
2020-04-25 Bram Moolenaarpatch 8.2.0639: MS-Windows: messages test still fails v8.2.0639
2020-04-25 Bram Moolenaarpatch 8.2.0638: MS-Windows: messages test fails v8.2.0638
2020-04-25 Bram Moolenaarpatch 8.2.0637: incsearch highlighting does not work... v8.2.0637
2020-04-25 Bram Moolenaarpatch 8.2.0636: :messages does not show the maintainer... v8.2.0636
2020-04-25 Bram Moolenaarpatch 8.2.0635: when using 256 colors DarkYellow does... v8.2.0635
2020-04-25 Bram Moolenaarpatch 8.2.0634: crash with null partial and blob v8.2.0634
2020-04-24 Bram Moolenaarpatch 8.2.0633: crash when using null partial in filter() v8.2.0633
2020-04-24 Bram Moolenaarpatch 8.2.0632: crash when using Haiku v8.2.0632
2020-04-24 Bram Moolenaarpatch 8.2.0631: Haiku file formatted with wrong tabstop v8.2.0631
2020-04-24 Bram Moolenaarpatch 8.2.0630: "make tags" does not cover Haiku GUI... v8.2.0630
2020-04-24 Bram Moolenaarpatch 8.2.0629: setting a boolean option to v:false... v8.2.0629
2020-04-23 Bram Moolenaarpatch 8.2.0628: error in menu translations v8.2.0628
2020-04-23 Bram Moolenaarpatch 8.2.0627: Vim9: error message does not work v8.2.0627
2020-04-23 Bram Moolenaarpatch 8.2.0626: Vim9: wrong syntax of function in Vim9... v8.2.0626
2020-04-23 Bram Moolenaarpatch 8.2.0625: Vim9: confusing error when calling... v8.2.0625
2020-04-23 Bram Moolenaarpatch 8.2.0624: Vim9: no check for space before #comment v8.2.0624
2020-04-23 Bram Moolenaarpatch 8.2.0623: typo in test comment v8.2.0623
2020-04-23 Bram Moolenaarpatch 8.2.0622: Haiku: GUI does not compile v8.2.0622
2020-04-23 Bram Moolenaarpatch 8.2.0621: after running tests asan files may... v8.2.0621
2020-04-23 Bram Moolenaarpatch 8.2.0620: error in menu translations v8.2.0620
2020-04-23 Bram Moolenaarpatch 8.2.0619: null dict is not handled like an empty... v8.2.0619
2020-04-22 Bram Moolenaarpatch 8.2.0618: echoing a null list results in no output v8.2.0618
2020-04-22 Bram Moolenaarpatch 8.2.0617: new error check triggers in Swedish... v8.2.0617
2020-04-21 Bram Moolenaarpatch 8.2.0616: build error when disabling the diff... v8.2.0616
2020-04-21 Bram Moolenaarpatch 8.2.0615: regexp benchmark stest is old style v8.2.0615
2020-04-21 Bram Moolenaarpatch 8.2.0614: get ml_get error when deleting a line... v8.2.0614
2020-04-20 Bram Moolenaarpatch 8.2.0613: Vim9: no check for space before #comment v8.2.0613
2020-04-20 Bram MoolenaarUpdate runtime files
2020-04-20 Bram Moolenaarpatch 8.2.0612: Vim9: no check for space before #comment v8.2.0612
2020-04-20 Bram Moolenaarpatch 8.2.0611: Vim9: no check for space before #comment v8.2.0611
2020-04-20 Bram Moolenaarpatch 8.2.0610: some tests are still old style v8.2.0610
2020-04-20 Bram Moolenaarpatch 8.2.0609: configure does not detect moonjit correctly v8.2.0609
2020-04-20 Bram Moolenaarpatch 8.2.0608: warning from clang when building messag... v8.2.0608
2020-04-19 Bram Moolenaarpatch 8.2.0607: gcc warns for using uninitialized variable v8.2.0607
2020-04-19 Bram Moolenaarpatch 8.2.0606: several syntax HL errors not checked v8.2.0606
2020-04-19 Bram Moolenaarpatch 8.2.0605: Vim9: cannot unlet an environment variable v8.2.0605
2020-04-19 Bram Moolenaarpatch 8.2.0604: :startinsert in a terminal window used... v8.2.0604
2020-04-19 Bram Moolenaarpatch 8.2.0603: configure does not detect moonjit v8.2.0603
2020-04-19 Bram Moolenaarpatch 8.2.0602: :unlet $VAR does not work properly v8.2.0602
2020-04-19 Bram Moolenaarpatch 8.2.0601: Vim9: :unlet is not compiled v8.2.0601
2020-04-19 Bram Moolenaarpatch 8.2.0600: Vim9: cannot read or write w:, t: and... v8.2.0600
2020-04-19 Bram Moolenaarpatch 8.2.0599: Netbeans interface insufficiently tested v8.2.0599
2020-04-18 Bram Moolenaarpatch 8.2.0598: test_eval_stuff fails in normal terminal v8.2.0598
2020-04-18 Bram Moolenaarpatch 8.2.0597: test_eval is old style v8.2.0597
2020-04-18 Bram Moolenaarpatch 8.2.0596: crash in test49 v8.2.0596
2020-04-18 Bram Moolenaarpatch 8.2.0595: Vim9: not all commands using ends_excmd... v8.2.0595
next